Target
PHD finger protein 1
Ligand
BDBM154550
Substrate
Meas. Tech.
AlphaScreen Assay
pH
8±0
Temperature
1937.05±0 K
IC50
>1.00e+5±n/a nM
Citation
 Perfetti, MTBaughman, BMDickson, BMMu, YCui, GMader, PDong, ANorris, JLRothbart, SBStrahl, BDBrown, PJJanzen, WPArrowsmith, CHMer, GMcBride, KMJames, LIFrye, SV Identification of a fragment-like small molecule ligand for the methyl-lysine binding protein, 53BP1. ACS Chem Biol 10:1072-81 (2015)  
Target
Name:
PHD finger protein 1
Synonyms:
PCL1 PHF1 | PHF1_HUMAN
Type:
Protein
Mol. Mass.:
62133.86
Organism:
Homo sapiens (Human)
Description:
O43189
Residue:
567
  
Inhibitor
Name:
BDBM154550
Synonyms:
3-Bromo-N-(3-(pyrrolidin-1-yl)propyl)benzamide (6)
Type:
Small organic molecule
Emp. Form.:
C14H19BrN2O
Mol. Mass.:
311.217
SMILES:
Brc1cccc(c1)C(=O)NCCCN1CCCC1
: