Target
E3 ubiquitin-protein ligase UHRF1
Ligand
BDBM154546
Substrate
Meas. Tech.
AlphaScreen Assay
pH
8±0
Temperature
1937.05±0 K
IC50
>1.00e+5±n/a nM
Citation
 Perfetti, MTBaughman, BMDickson, BMMu, YCui, GMader, PDong, ANorris, JLRothbart, SBStrahl, BDBrown, PJJanzen, WPArrowsmith, CHMer, GMcBride, KMJames, LIFrye, SV Identification of a fragment-like small molecule ligand for the methyl-lysine binding protein, 53BP1. ACS Chem Biol 10:1072-81 (2015)  
Target
Name:
E3 ubiquitin-protein ligase UHRF1
Synonyms:
6.3.2.- E3 ubiquitin-protein ligase UHRF1 ICBP90 NP95 Nuclear zinc finger protein Np95 RNF106 UHRF1 Ubiquitin-like PHD and RING finger domain-containing protein 1 hNp95 | hUHRF1
Type:
Protein
Mol. Mass.:
89822.48
Organism:
Homo sapiens (Human)
Description:
Residue:
793
  
Inhibitor
Name:
BDBM154546
Synonyms:
3-Bromo-N-(3-(dimethylamino)propyl)benzamide (2)
Type:
Small organic molecule
Emp. Form.:
C12H17BrN2O
Mol. Mass.:
285.18
SMILES:
CN(C)CCCNC(=O)c1cccc(Br)c1
: