Target
Chromobox protein homolog 7
Ligand
BDBM154564
Substrate
Meas. Tech.
AlphaScreen Assay
pH
8±0
Temperature
1390.75±0 K
IC50
>1.00e+5±n/a nM
Citation
 Perfetti, MTBaughman, BMDickson, BMMu, YCui, GMader, PDong, ANorris, JLRothbart, SBStrahl, BDBrown, PJJanzen, WPArrowsmith, CHMer, GMcBride, KMJames, LIFrye, SV Identification of a fragment-like small molecule ligand for the methyl-lysine binding protein, 53BP1. ACS Chem Biol 10:1072-81 (2015)  
Target
Name:
Chromobox protein homolog 7
Synonyms:
CBX7 Chromobox protein homolog 7 | Chromobox protein homolog 7 (CBX7)
Type:
Protein
Mol. Mass.:
28351.76
Organism:
Homo sapiens (Human)
Description:
Residue:
251
  
Inhibitor
Name:
BDBM154564
Synonyms:
N-(3-(Tert-butylamino)propyl)-3-isopropylbenzamide (20)
Type:
Small organic molecule
Emp. Form.:
C17H28N2O
Mol. Mass.:
276.417
SMILES:
CC(C)c1cccc(c1)C(=O)NCCCNC(C)(C)C
: