Target
Glycogen synthase kinase-3 beta
Ligand
BDBM155190
Substrate
Meas. Tech.
Inhibition Assay
pH
6.5±n/a
Temperature
298.15±n/a K
IC50
29.8±n/a nM
Comments
extracted
Citation
 Nakayama, KSakai, DWatanabe, KKohara, TAritomo, K Pyrimidone derivatives US Patent  US9006232 Publication Date 4/14/2015 
Target
Name:
Glycogen synthase kinase-3 beta
Synonyms:
Glycogen synthase kinase-3 beta (GSK3beta) | Tau protein kinase 1 (TPK1)
Type:
Protein
Mol. Mass.:
46641.23
Organism:
Bos taurus (cattle)
Description:
A0A059UE90
Residue:
419
  
Inhibitor
Name:
BDBM155190
Synonyms:
US9006232, 1.224
Type:
Small organic molecule
Emp. Form.:
C19H20N6O2
Mol. Mass.:
364.4011
SMILES:
Cn1c(OC2CCN(CC2)c2cccnc2)nc(cc1=O)-c1ccncn1
: