Target
High affinity nerve growth factor receptor
Ligand
BDBM406100
Substrate
Meas. Tech.
Kinase Binding Assay
IC50
550±n/a nM
Citation
 Allen, SAndrews, SWBlake, JFBrandhuber, BJHaas, JJiang, YKercher, TKolakowski, GRThomas, AAWinski, SL Bicyclic urea, thiourea, guanidine and cyanoguanidine compounds useful for the treatment of pain US Patent  US10351575 Publication Date 7/16/2019 
Target
Name:
High affinity nerve growth factor receptor
Synonyms:
2.7.10.1 NTRK1 NTRK1_HUMAN Neurotrophic tyrosine kinase receptor type 1 Synonyms=MTC TRK1-transforming tyrosine kinase protein TRKA GN Tropomyosin alpha-3 chain/High affinity nerve growth factor receptor Tropomyosin-related kinase A (TrkA) Tyrosine kinase receptor (Trk) Tyrosine kinase receptor A (Trk A) Tyrosine kinase receptor A (TrkA) p140-TrkA
Type:
Mol. Mass.:
87498.18
Organism:
Homo sapiens (Human)
Description:
P04629
Residue:
796
  
Inhibitor
Name:
BDBM406100
Synonyms:
US10351575, Example 53 | US10889589, EX. # 53
Type:
Small organic molecule
Emp. Form.:
C22H24N4O2
Mol. Mass.:
376.4516
SMILES:
CCOc1nn(c(NC(=O)NC2CCc3ccccc23)c1C)-c1ccccc1
: