Target
High affinity nerve growth factor receptor
Ligand
BDBM406145
Substrate
Meas. Tech.
Kinase Binding Assay
IC50
<100±n/a nM
Citation
 Allen, SAndrews, SWBlake, JFBrandhuber, BJHaas, JJiang, YKercher, TKolakowski, GRThomas, AAWinski, SL Bicyclic urea, thiourea, guanidine and cyanoguanidine compounds useful for the treatment of pain US Patent  US10351575 Publication Date 7/16/2019 
Target
Name:
High affinity nerve growth factor receptor
Synonyms:
2.7.10.1 NTRK1 NTRK1_HUMAN Neurotrophic tyrosine kinase receptor type 1 Synonyms=MTC TRK1-transforming tyrosine kinase protein TRKA GN Trk-A Tropomyosin-related kinase A Tyrosine kinase receptor Tyrosine kinase receptor A Tyrosine kinase receptor A (Trk-A) gp140trk | p140-TrkA
Type:
Mol. Mass.:
87498.18
Organism:
Homo sapiens (Human)
Description:
P04629
Residue:
796
  
Inhibitor
Name:
BDBM406145
Synonyms:
US10351575, Example 95
Type:
Small organic molecule
Emp. Form.:
C23H26N4O3
Mol. Mass.:
406.4775
SMILES:
Cc1c(NC(=O)NC2[C@H](O)CC(C)(C)c3ccccc23)n([nH]c1=O)-c1ccccc1
: