Target
Lysosomal acid glucosylceramidase
Ligand
BDBM36513
Substrate
Meas. Tech.
Enzyme Activity Assay
pH
5.2±n/a
Ki
83±n/a nM
IC50
150±n/a nM
Comments
extracted
Citation
 Aerts, JMOverkleeft, HS Activity based probes (ABPs) interacting with glycosidases US Patent  US9056847 Publication Date 6/16/2015 
Target
Name:
Lysosomal acid glucosylceramidase
Synonyms:
Acid beta-glucosidase Beta-glucocerebrosidase D-glucosyl-N-acylsphingosine glucohydrolase GBA1 GC GLUC Glucosylceramidase (GBA) Glucosylceramidase precursor (Beta-glucocerebrosidase) (Acid beta-glucosidase) (D-glucosyl-N-acylsphingosine glucohydrolase) (Alglucerase) (Imiglucerase) beta-glucocerebrosidase (GCase)
Type:
Enzyme
Mol. Mass.:
59724.64
Organism:
Homo sapiens (Human)
Description:
The beta-Glu activity was measured with commercially available beta-glucocerebrosidase (Ceredase) as the enzyme source.
Residue:
536
  
Inhibitor
Name:
BDBM36513
Synonyms:
CID46912128 US9056847, Azido-cyclophellitol
Type:
Small organic molecule
Emp. Form.:
C7H11N3O4
Mol. Mass.:
201.1799
SMILES:
O[C@H]1[C@@H]2O[C@@H]2[C@H](CN=[N+]=[N-])[C@@H](O)[C@@H]1O
: