Target
Hepatocyte growth factor receptor
Ligand
BDBM24472
Substrate
Meas. Tech.
In Vitro Assay
pH
8±n/a
Temperature
300.15±n/a K
Ki
7±n/a nM
Comments
extracted
Citation
 Albrecht, BKBauer, DBellon, SBode, CMBooker, SBoezio, AChoquette, DD'Amico, DHarmange, JHirai, SHungate, RWKim, TLewis, RTLiu, LLohman, JWNorman, MHPotashman, MSiegmund, ACSpringer, SKStec, MXi, NYang, K Fused heterocyclic derivatives and methods of use US Patent  US9066954 Publication Date 6/30/2015 
Target
Name:
Hepatocyte growth factor receptor
Synonyms:
Hepatocyte growth factor receptor Hepatocyte growth factor receptor (c-MET) MET Met proto-oncogene (hepatocyte growth factor receptor) Tyrosine-protein kinase Met (c-Met) c-Met kinase
Type:
Protein
Mol. Mass.:
155559.73
Organism:
Homo sapiens (Human)
Description:
P08581
Residue:
1390
  
Inhibitor
Name:
BDBM24472
Synonyms:
4-{[6-(3-fluorophenyl)-[1,2,4]triazolo[4,3-a]pyridazin-3-yl]methoxy}-7-methoxyquinoline US9066954, 1
Type:
Small organic molecule
Emp. Form.:
C22H16FN5O2
Mol. Mass.:
401.3931
SMILES:
COc1ccc2c(OCc3nnc4ccc(nn34)-c3cccc(F)c3)ccnc2c1
: