Target
UDP-3-O-acyl-N-acetylglucosamine deacetylase
Ligand
BDBM166417
Substrate
Meas. Tech.
Inhibition Assay
pH
6.5±n/a
Temperature
298.15±n/a K
IC50
121±n/a nM
Comments
extracted
Citation
 Takashima, HTsuruta, RYabuuchi, TOka, YUrabe, HSuga, YTakahashi, MUneuchi, FKotsubo, HShoji, MKawaguchi, Y Hydroxamic acid derivative US Patent  US9073821 Publication Date 7/7/2015 
Target
Name:
UDP-3-O-acyl-N-acetylglucosamine deacetylase
Synonyms:
LPXC_ECOLI UDP-3-O-[3-hydroxymyristoyl] N-acetylglucosamine deacetylase (LxpC) asmB lpxC
Type:
Enzyme
Mol. Mass.:
33952.00
Organism:
Escherichia coli
Description:
P0A725
Residue:
305
  
Inhibitor
Name:
BDBM166417
Synonyms:
US9073821, 425
Type:
Small organic molecule
Emp. Form.:
C26H34N4O5
Mol. Mass.:
482.572
SMILES:
CNC(=O)[C@](C)(N(C)C(=O)c1ccc(CCc2ccc(CN3CCOCC3)cc2)cc1)C(=O)NO
: