Target
UDP-3-O-acyl-N-acetylglucosamine deacetylase
Ligand
BDBM166426
Substrate
Meas. Tech.
Inhibition Assay
pH
6.5±n/a
Temperature
298.15±n/a K
IC50
108±n/a nM
Comments
extracted
Citation
 Takashima, HTsuruta, RYabuuchi, TOka, YUrabe, HSuga, YTakahashi, MUneuchi, FKotsubo, HShoji, MKawaguchi, Y Hydroxamic acid derivative US Patent  US9073821 Publication Date 7/7/2015 
Target
Name:
UDP-3-O-acyl-N-acetylglucosamine deacetylase
Synonyms:
LPXC_ECOLI UDP-3-O-[3-hydroxymyristoyl] N-acetylglucosamine deacetylase (LxpC) asmB lpxC
Type:
Enzyme
Mol. Mass.:
33952.00
Organism:
Escherichia coli
Description:
P0A725
Residue:
305
  
Inhibitor
Name:
BDBM166426
Synonyms:
US9073821, 557
Type:
Small organic molecule
Emp. Form.:
C27H32N4O5
Mol. Mass.:
492.5668
SMILES:
CCOC1CN(Cc2ccc(cc2)C#Cc2ccc(cc2)C(=O)N(C)[C@@](C)(C(=O)NC)C(=O)NO)C1
: