Target
Urease subunit alpha
Ligand
BDBM173598
Substrate
Meas. Tech.
Urease Inhibition Assay
pH
7±n/a
IC50
4.854e+4± 8e+1 nM
Comments
extracted
Citation
 Rahim, FZaman, KUllah, HTaha, MWadood, AJaved, MTRehman, WAshraf, MUddin, RUddin, IAsghar, HKhan, AAKhan, KM Synthesis of 4-thiazolidinone analogs as potent in vitro anti-urease agents. Bioorg Chem 63:123-31 (2015)  
Target
Name:
Urease subunit alpha
Synonyms:
URE1_SPOPA Urease | ureC
Type:
Enzyme Subunit
Mol. Mass.:
61384.55
Organism:
Bacillus pasteurii
Description:
Residue:
569
  
Inhibitor
Name:
BDBM173598
Synonyms:
4-((E)-((E)-(4-Oxothiazolidin-2-ylidene)hydrazono)methyl)benzaldehyde (11)
Type:
Small organic molecule
Emp. Form.:
C18H17N3O3S
Mol. Mass.:
355.411
SMILES:
COc1cc(\C=N\N=C2/NC(=O)CS2)ccc1OCc1ccccc1
: