Target
Thymidine phosphorylase
Ligand
BDBM50019242
Substrate
Meas. Tech.
Thymidine Phosphorylase Inhibition Assay
pH
7±n/a
IC50
4.29e+4± 1.0e+3 nM
Comments
extracted
Citation
 Javaid, SSaad, SMPerveen, SKhan, KMChoudhary, MI 2-Arylquinazolin-4(3H)-ones: A novel class of thymidine phosphorylase inhibitors. Bioorg Chem 63:142-51 (2015)  
Target
Name:
Thymidine phosphorylase
Synonyms:
TYPH_ECOSM deoA
Type:
Protein
Mol. Mass.:
47171.52
Organism:
Escherichia coli (Enterobacteria)
Description:
B1LEI7
Residue:
440
  
Inhibitor
Name:
BDBM50019242
Synonyms:
2-(3',4'-Dihydroxyphenyl)quinazolin-4(3H)-one (5) | CHEMBL3289117
Type:
Small organic molecule
Emp. Form.:
C14H10N2O3
Mol. Mass.:
254.2408
SMILES:
Oc1ccc(cc1O)-c1nc2ccccc2c(=O)[nH]1
: