Target
Androgen receptor
Ligand
BDBM179201
Substrate
Meas. Tech.
Reporter Assay
IC50
469±n/a nM
Citation
 Sawyers, CLJung, MEChen, CDOuk, STran, CWongvipat, J Treatment of hyperproliferative disorders with diarylhydantoin compounds US Patent  US9126941 Publication Date 9/8/2015 
Target
Name:
Androgen receptor
Synonyms:
ANDR_HUMAN Androgen Receptor Androgen receptor/Baculoviral IAP repeat-containing protein 2 Dihydrotestosterone receptor Nuclear receptor subfamily 3 group C member 4
Type:
Receptor
Mol. Mass.:
99185.27
Organism:
Homo sapiens (Human)
Description:
CHO cells were stably transfected with human AR gene.
Residue:
920
  
Inhibitor
Name:
BDBM179201
Synonyms:
US9126941, RD54
Type:
Small organic molecule
Emp. Form.:
C22H15F3N4OS
Mol. Mass.:
440.441
SMILES:
FC(F)(F)c1cc(ccc1[N+]#[C-])N1C(=S)N(c2ccc(cc2)C#N)C2(CCCC2)C1=O
: