Target
Hepatocyte growth factor receptor
Ligand
BDBM181026
Substrate
Meas. Tech.
In Vitro Receptor Tyrosine Kinase Assay
Temperature
300.15±n/a K
IC50
>5000±n/a nM
Comments
extracted
Citation
 Flynn, DLKaufman, MDSamarakoon, TCaldwell, TMVogeti, LAhn, YPatt, WCYates, KM Imidazolidinones and analogs exhibiting anti-cancer and anti-proliferative activities US Patent  US9133183 Publication Date 9/15/2015 
Target
Name:
Hepatocyte growth factor receptor
Synonyms:
Hepatocyte growth factor receptor Hepatocyte growth factor receptor (c-MET) MET Met proto-oncogene (hepatocyte growth factor receptor) Tyrosine-protein kinase Met (c-Met) c-Met kinase
Type:
Protein
Mol. Mass.:
155559.73
Organism:
Homo sapiens (Human)
Description:
P08581
Residue:
1390
  
Inhibitor
Name:
BDBM181026
Synonyms:
US9133183, Example 18
Type:
Small organic molecule
Emp. Form.:
C22H25N7O4
Mol. Mass.:
451.4784
SMILES:
COCCN1CCN(C(=O)Nc2ccc(Oc3ccnc(c3)-c3cnn(C)c3)c(C)n2)C1=O
: