Target
Vascular endothelial growth factor receptor 2
Ligand
BDBM181035
Substrate
Meas. Tech.
In Vitro Receptor Tyrosine Kinase Assay
Temperature
300.15±n/a K
IC50
>3300±n/a nM
Comments
extracted
Citation
 Flynn, DLKaufman, MDSamarakoon, TCaldwell, TMVogeti, LAhn, YPatt, WCYates, KM Imidazolidinones and analogs exhibiting anti-cancer and anti-proliferative activities US Patent  US9133183 Publication Date 9/15/2015 
Target
Name:
Vascular endothelial growth factor receptor 2
Synonyms:
CD_antigen=CD309 Fetal liver kinase 1 (FLK-1) KDR Protein-tyrosine kinase receptor Flk-1 VEGFR-2 VEGFR2 Vascular Endothelial Growth Factor Receptor Kinase 2 Vascular endothelial growth factor receptor 2 (KDR) Vascular endothelial growth factor receptor 2 (VEGFR2) Vascular endothelial growth factor receptor-2 (VEGFR-2)
Type:
Receptor Tyrosine Kinase
Mol. Mass.:
151510.97
Organism:
Homo sapiens (Human)
Description:
P35968
Residue:
1356
  
Inhibitor
Name:
BDBM181035
Synonyms:
US9133183, Example 101
Type:
Small organic molecule
Emp. Form.:
C23H26ClFN6O5
Mol. Mass.:
520.941
SMILES:
CN(C)C(=O)Nc1cc(Oc2cc(F)c(NC(=O)N3CCN(C4CCOCC4)C3=O)cc2Cl)ccn1
: