Target
Histone deacetylase 2
Ligand
BDBM182751
Substrate
Meas. Tech.
HDAC Enzyme Assay
pH
7.4±n/a
IC50
19±n/a nM
Comments
extracted
Citation
 van Duzer, JHMazitschek, R Selective HDAC1 and HDAC2 inhibitors US Patent  US9145412 Publication Date 9/29/2015 
Target
Name:
Histone deacetylase 2
Synonyms:
Cereblon/Histone deacetylase 2 HDAC2 Histone deacetylase 2 (HDAC2) | Human HDAC2
Type:
Chromatin regulator; hydrolase; repressor
Mol. Mass.:
55356.54
Organism:
Homo sapiens (Human)
Description:
Q92769
Residue:
488
  
Inhibitor
Name:
BDBM182751
Synonyms:
US9145412, Table 1, Compound 17
Type:
Small organic molecule
Emp. Form.:
C26H27N5O2
Mol. Mass.:
441.5249
SMILES:
Nc1ccc(cc1NC(=O)c1ccc2n(CCN3CCOCC3)ncc2c1)-c1ccccc1
: