Target
Cone cGMP-specific 3',5'-cyclic phosphodiesterase subunit alpha'
Ligand
BDBM86644
Substrate
Meas. Tech.
In Vitro Enzyme Assay
IC50
51200±n/a nM
Citation
 Hoffman, CSCeyhan, O Inhibitors of phosphodiesterase 11 (PDE11) US Patent  US9173884 Publication Date 11/3/2015 
Target
Name:
Cone cGMP-specific 3',5'-cyclic phosphodiesterase subunit alpha'
Synonyms:
3',5'-cyclic phosphodiesterase PDE6C_HUMAN Phosphodiesterase 6C | Phosphodiesterase 6C (PDE6C)
Type:
Protein
Mol. Mass.:
99132.02
Organism:
Homo sapiens (Human)
Description:
P51160
Residue:
858
  
Inhibitor
Name:
BDBM86644
Synonyms:
BC11-38-2 | US9173884, BC11-38-2
Type:
Small organic molecule
Emp. Form.:
C16H18N2OS2
Mol. Mass.:
318.457
SMILES:
CCC(C)Sc1nc2CCSc2c(=O)n1-c1ccccc1
: