Target
Cytochrome P450 2E1
Ligand
BDBM50110231
Substrate
Meas. Tech.
Fluorescent High Throughput P450 Assay
IC50
850±10 nM
Citation
 Maj, RPattarino, FMura, EBarberis, A Phospholipid drug analogs US Patent  US9173935 Publication Date 11/3/2015 
Target
Name:
Cytochrome P450 2E1
Synonyms:
CP2E1_HUMAN CYP2E1 | Cytochrome P450 2E1 (CYP2E1)
Type:
Enzyme
Mol. Mass.:
56860.34
Organism:
Homo sapiens (Human)
Description:
P05181
Residue:
493
  
Inhibitor
Name:
BDBM50110231
Synonyms:
3-(3-Nitro-phenyl)-3-{2-[4-(pyridin-2-ylamino)-butyrylamino]-acetylamino}-propionic acid | CHEMBL9737
Type:
Small organic molecule
Emp. Form.:
C20H23N5O6
Mol. Mass.:
429.4265
SMILES:
OC(=O)CC(NC(=O)CNC(=O)CCCNc1ccccn1)c1cccc(c1)[N+]([O-])=O
: