Target
Cytochrome P450 2C19
Ligand
BDBM189322
Substrate
BDBM189324
Meas. Tech.
Fluorescent High Throughput P450 Assay
IC50
6.70e+4±3800 nM
Citation
 Maj, RPattarino, FMura, EBarberis, A Phospholipid drug analogs US Patent  US9173935 Publication Date 11/3/2015 
Target
Name:
Cytochrome P450 2C19
Synonyms:
(R)-limonene 6-monooxygenase (S)-limonene 7-monooxygenase CYP2C19 CYPIIC19 Cytochrome P450 2C19 [I331V] Cytochrome P450-254C Mephenytoin 4-hydroxylase P450-254C
Type:
Enzyme
Mol. Mass.:
55935.47
Organism:
Homo sapiens (Human)
Description:
P33261
Residue:
490
  
Inhibitor
Name:
BDBM189322
Synonyms:
US9173935, SC12
Type:
Small organic molecule
Emp. Form.:
C46H75N6O11P
Mol. Mass.:
919.0951
SMILES:
CCCCCCCCCCCC(=O)OCC(CCP(O)(=O)OCCNC(=O)c1ccc(Cn2c3nc(OCCOC)nc(N)c3[nH]c2=O)cc1)OC(=O)CCCCCCCCCCC
:
Substrate
Name:
BDBM189324
Synonyms:
US9173935, AMMC
Type:
Substrate
Emp. Form.:
C18H26NO3
Mol. Mass.:
304.4034
SMILES:
CC[N+](C)(CC)CCc1c(C)c2ccc(OC)cc2oc1=O
: