Target
Cytochrome P450 2B6
Ligand
BDBM50240772
Substrate
Meas. Tech.
Fluorescent High Throughput P450 Assays
Temperature
310.15±n/a K
IC50
6900±1200 nM
Comments
extracted
Citation
 Maj, RPattarino, FMura, EBarberis, A Phospholipid drug analogs US Patent  US9180183 Publication Date 11/10/2015 
Target
Name:
Cytochrome P450 2B6
Synonyms:
CP2B6_HUMAN Cytochrome P450 2B6 (CYP2B6)
Type:
Protein
Mol. Mass.:
56289.75
Organism:
Homo sapiens (Human)
Description:
P20813
Residue:
491
  
Inhibitor
Name:
BDBM50240772
Synonyms:
(1R,2S)-(-)-2-phenylcyclopropylamine (tranylcypromine)2-Phenyl-cyclopropylamine CHEMBL1179 TRANYLCYPROMINE US10836743, Compound TCP US9180183, Tranylcypromine rel-Tranylcypromine
Type:
Small organic molecule
Emp. Form.:
C9H11N
Mol. Mass.:
133.1903
SMILES:
N[C@@H]1C[C@H]1c1ccccc1
: