Target
Enoyl-[acyl-carrier-protein] reductase [NADH]
Ligand
BDBM190659
Substrate
Meas. Tech.
Steady-State Kinetics
pH
8±n/a
Temperature
298.15±n/a K
Ki
2e+2±n/a nM
Comments
extracted
Citation
 Neckles, CPschibul, ALai, CTHirschbeck, MKuper, JDavoodi, SZou, JLiu, NPan, PShah, SDaryaee, FBommineni, GRLai, CSimmerling, CKisker, CTonge, PJ Selectivity of Pyridone- and Diphenyl Ether-Based Inhibitors for the Yersinia pestis FabV Enoyl-ACP Reductase. Biochemistry 55:2992-3006 (2016)  
Target
Name:
Enoyl-[acyl-carrier-protein] reductase [NADH]
Synonyms:
Enoyl-ACP reductase (Wt ypFabV) fabV
Type:
Protein
Mol. Mass.:
43335.99
Organism:
Yersinia pestis (Enterobacteria)
Description:
Residue:
399
  
Inhibitor
Name:
BDBM190659
Synonyms:
PT156
Type:
Small organic molecule
Emp. Form.:
C18H22N2O4
Mol. Mass.:
330.3783
SMILES:
CCCCCCc1cc(=O)c(Oc2ccc(cc2)[N+]([O-])=O)cn1C
: