Target
Sortilin
Ligand
BDBM159178
Substrate
Meas. Tech.
hSortilin Affinity Assay
pH
7.4±n/a
Ki
3048±n/a nM
IC50
3200±n/a nM
Comments
extracted
Citation
 Maltas, PJWatson, SLangg{hacek over (a)}rd, MDavid, L N-substituted-5-substituted phthalamic acids as sortilin inhibitors US Patent  US9682967 Publication Date 6/20/2017 
Target
Name:
Sortilin
Synonyms:
Neurotensin receptor 3 SORT_HUMAN
Type:
PROTEIN
Mol. Mass.:
92054.53
Organism:
Homo sapiens (Human)
Description:
ChEMBL_1282402
Residue:
831
  
Inhibitor
Name:
BDBM159178
Synonyms:
US10195186, Example 34 | US9682967, 32
Type:
Small organic molecule
Emp. Form.:
C13H10BrN3O3
Mol. Mass.:
336.141
SMILES:
Cc1ccc(NC(=O)c2ccc(Br)cc2C(O)=O)nn1
: