Target
Beta-secretase 1 [1-458]
Ligand
BDBM195492
Substrate
Meas. Tech.
BACE Enzyme Assay (Ex.435)
pH
4.4±n/a
IC50
9.5±n/a nM
Comments
extracted
Citation
 Cacatian, SClaremon, DADillard, LWFuchs, KHeine, NJia, LLeftheris, KMcKeever, BMorales-Ramos, ASingh, SBVenkatraman, SWu, GWu, ZXu, ZYuan, JZheng, Y Inhibitors of beta-secretase US Patent  US9212153 Publication Date 12/15/2015 
Target
Name:
Beta-secretase 1 [1-458]
Synonyms:
BACE BACE1_HUMAN KIAA1149
Type:
Mol. Mass.:
50753.53
Organism:
Homo sapiens (Human)
Description:
Truncation 1-458 aa with His-tag at C-terminus
Residue:
458
  
Inhibitor
Name:
BDBM195492
Synonyms:
US9212153, 207,Ex. 167
Type:
Small organic molecule
Emp. Form.:
C22H26N4O2S
Mol. Mass.:
410.532
SMILES:
COC1CCC2(Cc3ccc(cc3C22N=C(N)N(C)C2=O)-c2cnc(C)s2)CC1
: