Target
Beta-secretase 1 [1-458]
Ligand
BDBM195213
Substrate
Meas. Tech.
BACE Enzyme Assay (Ex.435)
pH
4.4±n/a
IC50
13.5±n/a nM
Comments
extracted
Citation
 Cacatian, SClaremon, DADillard, LWFuchs, KHeine, NJia, LLeftheris, KMcKeever, BMorales-Ramos, ASingh, SBVenkatraman, SWu, GWu, ZXu, ZYuan, JZheng, Y Inhibitors of beta-secretase US Patent  US9212153 Publication Date 12/15/2015 
Target
Name:
Beta-secretase 1 [1-458]
Synonyms:
BACE BACE1_HUMAN KIAA1149
Type:
Mol. Mass.:
50753.53
Organism:
Homo sapiens (Human)
Description:
Truncation 1-458 aa with His-tag at C-terminus
Residue:
458
  
Inhibitor
Name:
BDBM195213
Synonyms:
US10336717, Compound 279 | US9212153, 279,Ex. 230
Type:
Small organic molecule
Emp. Form.:
C23H29F2N3O2
Mol. Mass.:
417.4921
SMILES:
CN1C(N)=NC2(C1=O)c1cc(CCC3CC3)ccc1C[C@@]21CC[C@@H](CC1)OC(F)F
: