Target
Polyphenol oxidase 1 [61-568]
Ligand
BDBM195548
Substrate
BDBM60928
Meas. Tech.
Tyrosinase Activity Assay
pH
6.8±n/a
IC50
733± 83 nM
Comments
extracted
Citation
 Tang, JLiu, JWu, F Molecular docking studies and biological evaluation of 1,3,4-thiadiazole derivatives bearing Schiff base moieties as tyrosinase inhibitors. Bioorg Chem 69:29-36 (2016)  
Target
Name:
Polyphenol oxidase 1 [61-568]
Synonyms:
PPO1 Polyphenol oxidase | Tyrosinase
Type:
Protein
Mol. Mass.:
57193.31
Organism:
Agaricus bisporus (Mushroom)
Description:
Q00024[61-568]
Residue:
508
  
Inhibitor
Name:
BDBM195548
Synonyms:
2-((2-Methoxybenzylidene)amino)-5-mercapto-1,3,4-thiadiazole (10)
Type:
Small organic molecule
Emp. Form.:
C10H9N3OS2
Mol. Mass.:
251.328
SMILES:
COc1ccccc1C=Nc1nnc(S)s1
:
Substrate
Name:
BDBM60928
Synonyms:
BDBM50130192 L-DOPA dihydroxyphenylalanine
Type:
Emp. Form.:
C9H11NO4
Mol. Mass.:
197.1879
SMILES:
N[C@@H](Cc1ccc(O)c(O)c1)C(O)=O
: