Target
Genome polyprotein
Ligand
BDBM196120
Substrate
Meas. Tech.
Protease Assay
IC50
0.9±n/a nM
Citation
 Brandl, TRaman, PRigollier, PSeepersaud, MSimic, O Organic compounds and their uses US Patent  US9206232 Publication Date 12/8/2015 
Target
Name:
Genome polyprotein
Synonyms:
Dipeptidyl peptidase 4 (DPP4) NS3 NS5B NS3-4A Protease NS3/4A protease POLG_HCV77 | RNA polymerase (NS5B)
Type:
Protease Domain
Mol. Mass.:
327221.49
Organism:
Hepatitis C virus (HCV genotype 1a, isolate H)
Description:
P27958
Residue:
3011
  
Inhibitor
Name:
BDBM196120
Synonyms:
US9206232, 77
Type:
Small organic molecule
Emp. Form.:
C44H73N7O7S
Mol. Mass.:
844.158
SMILES:
CCN(CC)S(=O)(=O)NC(=O)[C@]1(C[C@H]1C=C)NC(=O)[C@@H]1C[C@@]2(CN1C(=O)[C@@H](NC(=O)C(NC(=O)[C@@H]1CCCCN1CC)C1CCCCC1)C(C)(C)C)C(C)(C)C21CCC1
: