Target
Isoform 1 of Metabotropic glutamate receptor 5 (5a)
Ligand
BDBM199986
Substrate
Meas. Tech.
Binding Assay
pH
7.4±n/a
Ki
315±0.0 nM
Comments
extracted
Citation
 Jaeschke, GLindemann, LRicci, ARueher, DStadler, HVieira, E Ethynyl derivatives US Patent  US9227959 Publication Date 1/5/2016 
Target
Name:
Isoform 1 of Metabotropic glutamate receptor 5 (5a)
Synonyms:
GPRC1E GRM5_HUMAN Metabotropic glutamate receptor 5 Metabotropic glutamate receptor 5 (mGlu5a) Metabotropic glutamate receptor 5a (mGluR5) Metabotropic glutamate receptor subtype 5 (mGluR5)
Type:
Enzyme
Mol. Mass.:
128885.13
Organism:
Homo sapiens (Human)
Description:
P41594-2
Residue:
1180
  
Inhibitor
Name:
BDBM199986
Synonyms:
US9227959, Reference Compound 2, Ex. 46
Type:
Small organic molecule
Emp. Form.:
C20H21N3O
Mol. Mass.:
319.4002
SMILES:
CC1(C)CCCN(C1)C(=O)c1ncc(cn1)C#Cc1ccccc1
: