Target
Plasma kallikrein
Ligand
BDBM212114
Substrate
Meas. Tech.
In-vitro Plasma Kallikrein Inhibition
pH
7.8±n/a
Temperature
298.15±n/a K
IC50
0.04±n/a nM
Comments
extracted
Citation
 Brandl, TFlohr, SKopec, SLachal, JMarkert, CNamoto, KNganga, PPirard, BRenatus, MSedrani, RZoller, T N-((6-amino-pyridin-3-yl)methyl)-heteroaryl-carboxamides US Patent  US9290485 Publication Date 3/22/2016 
Target
Name:
Plasma kallikrein
Synonyms:
Fletcher factor KLKB1 Kallikrein Plasma kallikrein heavy chain Plasma prekallikrein
Type:
Protein
Mol. Mass.:
71391.16
Organism:
Homo sapiens (Human)
Description:
P03952
Residue:
638
  
Inhibitor
Name:
BDBM212114
Synonyms:
US9290485, 146
Type:
Small organic molecule
Emp. Form.:
C24H27N7O
Mol. Mass.:
429.5175
SMILES:
Cc1cnn(Cc2ccc(Cn3cc(cn3)C(=O)NCc3c(C)cc(N)nc3C)cc2)c1
: