Target
Amine oxidase [flavin-containing] A
Ligand
BDBM218826
Substrate
Meas. Tech.
In-vitro Monoamine Oxidase Inhibition Assay
pH
7.4±n/a
IC50
9± 0.1 nM
Comments
extracted
Citation
 Abbas, NZaib, SBakht, SMIbrar, AKhan, IBatool, SSaeed, AIqbal, J Symmetrical aryl linked bis-iminothiazolidinones as new chemical entities for the inhibition of monoamine oxidases: Synthesis, in vitro biological evaluation and molecular modelling analysis. Bioorg Chem 70:17-26 (2017)  
Target
Name:
Amine oxidase [flavin-containing] A
Synonyms:
AOFA_HUMAN MAO-A Monoamine oxidase Monoamine oxidase type A (MAO A) Monoamine oxidase type A (MAOA)
Type:
Protein
Mol. Mass.:
59689.53
Organism:
Homo sapiens (Human)
Description:
P21397
Residue:
527
  
Inhibitor
Name:
BDBM218826
Synonyms:
1,2-Bis(2-(2-chlorobenzoylimino)-5-(2-methoxy-2-oxoethylidene)-4-oxo-thiazolidin-3-yl)benzene (3e)
Type:
Small organic molecule
Emp. Form.:
C32H20Cl2N4O8S2
Mol. Mass.:
723.559
SMILES:
COC(=O)\C=C1/S\C(=N/C(=O)c2ccccc2Cl)N(C1=O)c1ccccc1N1\C(S\C(=C/C(=O)OC)C1=O)=N\C(=O)c1ccccc1Cl
: