Target
Metabotropic glutamate receptor 2
Ligand
BDBM50017280
Substrate
Meas. Tech.
mGlu Receptor In Vitro Assays
pH
7.3±n/a
Temperature
298.15±n/a K
EC50
1091±48 nM
Comments
extracted
Citation
 Dhanya, RPSheffler, DJCosford, NDDahl, R Metabotropic glutamate receptor positive allosteric modulators (PAMS) and uses thereof US Patent  US10099993 Publication Date 10/16/2018 
Target
Name:
Metabotropic glutamate receptor 2
Synonyms:
GPRC1B GRM2_HUMAN Metabotropic glutamate receptor mGlu2 | metabotropic glutamate 2
Type:
Enzyme
Mol. Mass.:
95584.88
Organism:
Homo sapiens (Human)
Description:
Q14416
Residue:
872
  
Inhibitor
Name:
BDBM50017280
Synonyms:
CHEMBL3287704 | US10099993, Compound 53
Type:
Small organic molecule
Emp. Form.:
C21H24O7
Mol. Mass.:
388.4111
SMILES:
COc1ccc(cc1OCCCCOc1ccc(C(C)=O)c(O)c1C)C(O)=O
: