Target
Alkaline phosphatase, tissue-nonspecific isozyme
Ligand
BDBM223072
Substrate
Meas. Tech.
Alkaline Phosphatase Inhibition Assay
pH
9.8±n/a
Temperature
310.15±n/a K
IC50
4130±910 nM
Comments
extracted
Citation
 Channar, PAShah, SJHassan, SNisa, ZULecka, JSévigny, JBajorath, JSaeed, AIqbal, J Isonicotinohydrazones as inhibitors of alkaline phosphatase and ecto-5'-nucleotidase. Chem Biol Drug Des 89:365-370 (2017)  
Target
Name:
Alkaline phosphatase, tissue-nonspecific isozyme
Synonyms:
ALPL Alkaline phosphatase liver/bone/kidney isozyme PPBT_BOVIN Tissue non-specific alkaline phosphatase (TNAP)
Type:
Protein
Mol. Mass.:
57195.60
Organism:
Bos taurus (Cattle)
Description:
P09487
Residue:
524
  
Inhibitor
Name:
BDBM223072
Synonyms:
(E)-N'-(4'-Bromobenzylidene)isonicotinohydrazide (3b)
Type:
Small organic molecule
Emp. Form.:
C13H10BrN3O
Mol. Mass.:
304.142
SMILES:
Brc1ccc(\C=N\NC(=O)c2ccncc2)cc1
: