Target
Intestinal-type alkaline phosphatase
Ligand
BDBM223077
Substrate
Meas. Tech.
Alkaline Phosphatase Inhibition Assay
pH
9.8±n/a
Temperature
310.15±n/a K
IC50
1920±30 nM
Comments
extracted
Citation
 Channar, PAShah, SJHassan, SNisa, ZULecka, JSévigny, JBajorath, JSaeed, AIqbal, J Isonicotinohydrazones as inhibitors of alkaline phosphatase and ecto-5'-nucleotidase. Chem Biol Drug Des 89:365-370 (2017)  
Target
Name:
Intestinal-type alkaline phosphatase
Synonyms:
ALPI Intestinal alkaline phosphatase (IAP) PPBI_BOVIN
Type:
Protein
Mol. Mass.:
57094.82
Organism:
Bos taurus (Cattle)
Description:
P19111
Residue:
533
  
Inhibitor
Name:
BDBM223077
Synonyms:
(E)-N'-(4'-Hydroxy-3-methoxybenzylidene)isonicotinohydrazide (3g)
Type:
Small organic molecule
Emp. Form.:
C14H13N3O3
Mol. Mass.:
271.2713
SMILES:
COc1cc(\C=N\NC(=O)c2ccncc2)ccc1O
: