Target
BRISC and BRCA1-A complex member 1/BRISC and BRCA1-A complex member 2/BRISC complex subunit Abraxas 2/Lys-63-specific deubiquitinase BRCC36
Ligand
BDBM224012
Substrate
Meas. Tech.
In Vitro BRCC36 Activity Assay
IC50
2.3e+3±n/a nM
Citation
 Li, JYakushi, TParlati, FMackinnon, ALPerez, CMa, YCarter, KPColayco, SMagnuson, GBrown, BNguyen, KVasile, SSuyama, ESmith, LHSergienko, EPinkerton, ABChung, TDYPalmer, AEPass, IHess, SCohen, SMDeshaies, RJ Capzimin is a potent and specific inhibitor of proteasome isopeptidase Rpn11. Nat Chem Biol 13:486-493 (2017)  
Target
Name:
BRISC and BRCA1-A complex member 1/BRISC and BRCA1-A complex member 2/BRISC complex subunit Abraxas 2/Lys-63-specific deubiquitinase BRCC36
Synonyms:
BRISC complex
Type:
Protein
Mol. Mass.:
Description:
Human BRISC complex (BRCC36/KIAA0157/BRCC45/MERIT40)
Components:
This complex has 4 components.
Component 1
Name:
Lys-63-specific deubiquitinase BRCC36
Synonyms:
BRCC3 BRCC3_HUMAN C6.1A | CXorf53
Type:
Protein
Mol. Mass.:
36065.48
Organism:
Homo sapiens (Human)
Description:
P46736
Residue:
316
  
Component 2
Name:
BRISC complex subunit Abraxas 2
Synonyms:
ABRAXAS2 ABRX2_HUMAN FAM175B | KIAA0157
Type:
Protein
Mol. Mass.:
46897.76
Organism:
Homo sapiens (Human)
Description:
Q15018
Residue:
415
  
Component 3
Name:
BRISC and BRCA1-A complex member 2
Synonyms:
BABA2_HUMAN BRCC45 BRISC complex subunit BRCC45 (BRCC45)
Type:
Protein
Mol. Mass.:
43546.64
Organism:
Homo sapiens (Human)
Description:
Q9NXR7
Residue:
383
  
Component 4
Name:
BRISC and BRCA1-A complex member 1
Synonyms:
BABA1_HUMAN BRISC complex subunit MERIT40 (MERIT40) MERIT40 | NBA1
Type:
Protein
Mol. Mass.:
36535.96
Organism:
Homo sapiens (Human)
Description:
Q9NWV8
Residue:
329
  
Inhibitor
Name:
BDBM224012
Synonyms:
Capzimin | US10005735, Compound 12
Type:
Small organic molecule
Emp. Form.:
C15H13N3OS2
Mol. Mass.:
315.413
SMILES:
Sc1cccc2cc(cnc12)C(=O)NCCc1nccs1
: