Target
Dual specificity protein phosphatase 5
Ligand
BDBM231697
Substrate
Meas. Tech.
pERK Assay
IC50
4.8e+3±n/a nM
Citation
 Bongard, RDLepley, MThakur, KTalipov, MRNayak, JLipinski, RAJBohl, CSweeney, NRamchandran, RRathore, RSem, DS Serendipitous discovery of light-induced (In Situ) formation of an Azo-bridged dimeric sulfonated naphthol as a potent PTP1B inhibitor. BMC Biochem 18:1-15 (2017)  
Target
Name:
Dual specificity protein phosphatase 5
Synonyms:
DUS5_HUMAN Dual-specificity phosphatase 5 phophatase (DUSP5) | VH3
Type:
Enzyme
Mol. Mass.:
42058.96
Organism:
Homo sapiens (Human)
Description:
Q16690
Residue:
384
  
Inhibitor
Name:
BDBM231697
Synonyms:
RR601
Type:
Small organic molecule
Emp. Form.:
C20H14N2O8S2
Mol. Mass.:
474.464
SMILES:
Oc1cc(cc2c(cccc12)\N=N\c1cccc2c(O)cc(cc12)S(O)(=O)=O)S(O)(=O)=O
: