Target
Cathepsin D
Ligand
BDBM232252
Substrate
Meas. Tech.
In-Vitro Fluorescence Assay
pH
5.5±n/a
Temperature
298.15±n/a K
IC50
5.1±n/a nM
Comments
extracted
Citation
 Klein, MTsaklakidis, CGuehring, HLeuthner, B Aminostatin derivatives for the treatment of arthrosis US Patent  US9345742 Publication Date 5/24/2016 
Target
Name:
Cathepsin D
Synonyms:
CATD_HUMAN CTSD Cathepsin D heavy chain Cathepsin D precursor
Type:
Enzyme
Mol. Mass.:
44551.72
Organism:
Homo sapiens (Human)
Description:
Human proCathepsin D (SwissProt accession number P07339) was expressed in Sf9 cells, purified, and autoactivated.
Residue:
412
  
Inhibitor
Name:
BDBM232252
Synonyms:
US9345742, 10
Type:
Small organic molecule
Emp. Form.:
C39H66N6O7
Mol. Mass.:
730.9773
SMILES:
CC[C@H](C)[C@H](NC(=O)C[C@H](N)[C@H](Cc1ccccc1)NC(=O)[C@@H](NC(=O)[C@H](CC(C)C)NC(=O)CC(C)C)C(C)C)C(=O)N[C@@H](C(C)C)C(=O)OC
: