Target
Bcl-2-like protein 1
Ligand
BDBM232405
Substrate
Meas. Tech.
Fluorescence Resonance Energy Transfer Assay (FRET)
Temperature
298.15±n/a K
IC50
30±n/a nM
Comments
extracted
Citation
 Borzilleri, RMCai, ZTebben, AJPerez, HLZhang, LSchroeder, GMWei, DD Substituted sulfonamides useful as antiapoptotic Bcl inhibitors US Patent  US9346795 Publication Date 5/24/2016 
Target
Name:
Bcl-2-like protein 1
Synonyms:
Anti-apoptotic Bcl-2 protein Apoptosis regulator Bcl-X BCL2-like 1 isoform 1 BCL2L1 Bcl-2-like protein 1 (Bcl-XL) Bcl-xL/Bcl-2-binding component 3 Bcl2-antagonist of cell death (BAD)
Type:
Mitochondrion membrane; Single-pass membrane protein
Mol. Mass.:
26039.60
Organism:
Homo sapiens (Human)
Description:
Residue:
233
  
Inhibitor
Name:
BDBM232405
Synonyms:
US9346795, 82
Type:
Small organic molecule
Emp. Form.:
C45H54ClN7O6S
Mol. Mass.:
856.472
SMILES:
CCCCN(CCCC)C(=O)c1nn(c(C)c1Cl)-c1ccc(cc1C(=O)N1CCc2ccccc2C1)C(=O)NS(=O)(=O)c1ccc2n(CCCN3CCOCC3)ccc2c1
: