Target
Bcl-2-like protein 1
Ligand
BDBM232414
Substrate
Meas. Tech.
Fluorescence Resonance Energy Transfer Assay (FRET)
Temperature
298.15±n/a K
IC50
10±n/a nM
Comments
extracted
Citation
 Borzilleri, RMCai, ZTebben, AJPerez, HLZhang, LSchroeder, GMWei, DD Substituted sulfonamides useful as antiapoptotic Bcl inhibitors US Patent  US9346795 Publication Date 5/24/2016 
Target
Name:
Bcl-2-like protein 1
Synonyms:
Anti-apoptotic Bcl-2 protein Apoptosis regulator Bcl-X BCL2-like 1 isoform 1 BCL2L1 Bcl-2-like protein 1 (Bcl-XL) Bcl-xL/Bcl-2-binding component 3 Bcl2-antagonist of cell death (BAD)
Type:
Mitochondrion membrane; Single-pass membrane protein
Mol. Mass.:
26039.60
Organism:
Homo sapiens (Human)
Description:
Residue:
233
  
Inhibitor
Name:
BDBM232414
Synonyms:
US9346795, 119
Type:
Small organic molecule
Emp. Form.:
C43H48ClN5O7S
Mol. Mass.:
814.389
SMILES:
CCCCN(CCCC)C(=O)c1nn(c(C)c1Cl)-c1ccc(cc1C(=O)N1Cc2ccccc2C[C@H]1COCCO)C(=O)NS(=O)(=O)c1ccc2ccccc2c1
: