Target
Epidermal growth factor receptor [T790M]
Ligand
BDBM50171880
Substrate
Meas. Tech.
Kinase-Glo luminescent kinase assay
IC50
<50.0±n/a nM
Citation
 Sheng, WYang, LPan, Z Quinazoline heterocyclic compound as EGFR kinase inhibitor and preparation and application thereof US Patent  US10106508 Publication Date 10/23/2018 
Target
Name:
Epidermal growth factor receptor [T790M]
Synonyms:
EGFR ERBB Epidermal growth factor receptor (EGFR) T790M Epidermal growth factor receptor (EGFR)(T790M) HER1
Type:
Enzyme
Mol. Mass.:
134309.68
Organism:
Homo sapiens (Human)
Description:
P00533 (T790M)
Residue:
1210
  
Inhibitor
Name:
BDBM50171880
Synonyms:
CHEMBL3804868 | US10106508, Compound I-37
Type:
Small organic molecule
Emp. Form.:
C19H18ClN3O3
Mol. Mass.:
371.818
SMILES:
CCOc1cc2ncnc(Nc3ccc(C)c(Cl)c3)c2c2OCCOc12
: