Target
Epidermal growth factor receptor
Ligand
BDBM50154255
Substrate
Meas. Tech.
Kinase-Glo luminescent kinase assay
IC50
<50.0±n/a nM
Citation
 Sheng, WYang, LPan, Z Quinazoline heterocyclic compound as EGFR kinase inhibitor and preparation and application thereof US Patent  US10106508 Publication Date 10/23/2018 
Target
Name:
Epidermal growth factor receptor
Synonyms:
EGF Receptor Substrate EGFR_HUMAN ERBB1 Epidermal Growth Factor Receptor erbB-1 Epidermal growth factor receptor (EGFR) HER1 Proto-oncogene c-ErbB-1 Tyrosine-Protein Kinase ErbB-1
Type:
Receptor Kinase Domain
Mol. Mass.:
134279.59
Organism:
Homo sapiens (Human)
Description:
P00533
Residue:
1210
  
Inhibitor
Name:
BDBM50154255
Synonyms:
CHEMBL3774926 | US10106508, Compound II-1
Type:
Small organic molecule
Emp. Form.:
C25H25N5O3
Mol. Mass.:
443.4977
SMILES:
O=C1COc2cc3ncnc(Nc4cccc(c4)C#C)c3cc2N1CCCN1CCOCC1
: