Target
Lysine-specific demethylase 4C
Ligand
BDBM293741
Substrate
Meas. Tech.
JMJD2C Assay
Temperature
298.15±n/a K
IC50
550±n/a nM
Comments
extracted
Citation
 Boloor, AChen, YKWallace, MB Histone demethylase inhibitors US Patent  US10106534 Publication Date 10/23/2018 
Target
Name:
Lysine-specific demethylase 4C
Synonyms:
GASC-1 protein Gene amplified in squamous cell carcinoma 1 protein JMJD2C Jumonji domain-containing protein 2C KDM4C_HUMAN | KIAA0780
Type:
Protein
Mol. Mass.:
119979.01
Organism:
Homo sapiens (Human)
Description:
Q9H3R0
Residue:
1056
  
Inhibitor
Name:
BDBM293741
Synonyms:
3-({[(1S)-6-(4-methylbenzenesulfonyl)-1,2,3,4- | US10106534, Example 83
Type:
Small organic molecule
Emp. Form.:
C24H24N2O4S
Mol. Mass.:
436.523
SMILES:
Cc1ccc(cc1)S(=O)(=O)c1ccc2[C@@H](CNc3cnccc3C(O)=O)CCCc2c1
: