Target
Lysine-specific demethylase 6B
Ligand
BDBM293757
Substrate
Meas. Tech.
JMJD3 Assay
Temperature
298.15±n/a K
IC50
550±n/a nM
Comments
extracted
Citation
 Boloor, AChen, YKWallace, MB Histone demethylase inhibitors US Patent  US10106534 Publication Date 10/23/2018 
Target
Name:
Lysine-specific demethylase 6B
Synonyms:
JMJD3 Jumonji domain-containing protein 3 KDM6B_HUMAN Lysine demethylase 6B Lysine-specific demethylase 6B (KDM6B(JMJD3)) | Lysine-specific demethylase 6B (KDM6B)
Type:
Protein
Mol. Mass.:
176672.55
Organism:
Homo sapiens (Human)
Description:
O15054
Residue:
1643
  
Inhibitor
Name:
BDBM293757
Synonyms:
3-({[(1R)-6-methoxy-5-methyl-1,2,3,4-tetrahydronaphthalen-1- | US10106534, Example 99
Type:
Small organic molecule
Emp. Form.:
C19H22N2O3
Mol. Mass.:
326.3896
SMILES:
COc1ccc2[C@H](CNc3cnccc3C(O)=O)CCCc2c1C
: