Target
Lysine-specific demethylase 6B
Ligand
BDBM293796
Substrate
Meas. Tech.
JMJD3 Assay
Temperature
298.15±n/a K
IC50
5500±n/a nM
Comments
extracted
Citation
 Boloor, AChen, YKWallace, MB Histone demethylase inhibitors US Patent  US10106534 Publication Date 10/23/2018 
Target
Name:
Lysine-specific demethylase 6B
Synonyms:
JMJD3 Jumonji domain-containing protein 3 KDM6B_HUMAN Lysine demethylase 6B Lysine-specific demethylase 6B (KDM6B(JMJD3)) | Lysine-specific demethylase 6B (KDM6B)
Type:
Protein
Mol. Mass.:
176672.55
Organism:
Homo sapiens (Human)
Description:
O15054
Residue:
1643
  
Inhibitor
Name:
BDBM293796
Synonyms:
3-({[(4R)-7-(2-hydroxyphenyl)-3,4-dihydro-2H-1-benzopyran-4- | US10106534, Example 138
Type:
Small organic molecule
Emp. Form.:
C22H20N2O4
Mol. Mass.:
376.4052
SMILES:
OC(=O)c1ccncc1NC[C@@H]1CCOc2cc(ccc12)-c1ccccc1O
: