Target
Lysine-specific demethylase 4C
Ligand
BDBM293870
Substrate
Meas. Tech.
JMJD2C Assay
Temperature
298.15±n/a K
IC50
550±n/a nM
Comments
extracted
Citation
 Boloor, AChen, YKWallace, MB Histone demethylase inhibitors US Patent  US10106534 Publication Date 10/23/2018 
Target
Name:
Lysine-specific demethylase 4C
Synonyms:
GASC-1 protein Gene amplified in squamous cell carcinoma 1 protein JMJD2C Jumonji domain-containing protein 2C KDM4C_HUMAN | KIAA0780
Type:
Protein
Mol. Mass.:
119979.01
Organism:
Homo sapiens (Human)
Description:
Q9H3R0
Residue:
1056
  
Inhibitor
Name:
BDBM293870
Synonyms:
3-({[(4R)-7-[methyl(4-propoxyphenyl)amino]-3,4-dihydro-2H-1- | US10106534, Example 212
Type:
Small organic molecule
Emp. Form.:
C26H29N3O4
Mol. Mass.:
447.5262
SMILES:
CCCOc1ccc(cc1)N(C)c1ccc2[C@H](CNc3cnccc3C(O)=O)CCOc2c1
: