Target
Carbonic anhydrase 2
Ligand
BDBM239176
Substrate
BDBM237235
Meas. Tech.
Esterase Assay
pH
7.4±0
Temperature
298.15±0 K
Ki
3.59e+3±n/a nM
Citation
 Ekinci, DFidan, İDurdagi, SKaban, ſSupuran, CT Kinetic and in silico analysis of thiazolidin-based inhibitors of a-carbonic anhydrase isoenzymes. J Enzyme Inhib Med Chem 28:370-4 (2013)  
Target
Name:
Carbonic anhydrase 2
Synonyms:
CA-II CAC Carbonate dehydratase II Carbonic anhydrase 2 (CA-II) Carbonic anhydrase C Carbonic anhydrase II (CA-II) Carbonic anhydrase II (hCA II) | Carbonic anhydrase isoenzyme II (hCA II)
Type:
Enzyme
Mol. Mass.:
29250.71
Organism:
Homo sapiens (Human)
Description:
P00918
Residue:
260
  
Inhibitor
Name:
BDBM239176
Synonyms:
Thiazolidin-based CA inhibitor, 5b
Type:
Small organic molecule
Emp. Form.:
C15H16N2OS2
Mol. Mass.:
304.43
SMILES:
C[C@H]1S[C@H](N(C1=O)c1cccc(C)n1)c1sccc1C
:
Substrate
Name:
BDBM237235
Synonyms:
4-Nitrophenylacetate
Type:
Small organic molecule
Emp. Form.:
C8H7NO4
Mol. Mass.:
181.1455
SMILES:
OC(=O)Cc1ccc(cc1)[N+]([O-])=O
: