Target
Tyrosine-protein kinase JAK1
Ligand
BDBM239965
Substrate
Meas. Tech.
Kinase Assay
pH
7.5±n/a
Temperature
298.15±n/a K
IC50
0.9±n/a nM
Comments
extracted
Citation
 Xi, NLi, MHu, HDai, W Substituted heteroaryl compounds and methods of use US Patent  US9403801 Publication Date 8/2/2016 
Target
Name:
Tyrosine-protein kinase JAK1
Synonyms:
JAK-1 JAK1A JAK1_HUMAN Janus kinase 1 (JAK1) | Janus kinase 1 JAK1
Type:
Protein
Mol. Mass.:
133293.73
Organism:
Homo sapiens (Human)
Description:
P23458
Residue:
1154
  
Inhibitor
Name:
BDBM239965
Synonyms:
US9403801, 30
Type:
Small organic molecule
Emp. Form.:
C20H25ClF3N7O
Mol. Mass.:
471.907
SMILES:
Cn1cc(Nc2ncc(Cl)c(NC3CCC4(CC3)CCN(CC4)C(=O)C(F)(F)F)n2)cn1
: