Target
Tyrosine-protein kinase JAK1
Ligand
BDBM239983
Substrate
Meas. Tech.
Kinase Assay
pH
7.5±n/a
Temperature
298.15±n/a K
IC50
42±n/a nM
Comments
extracted
Citation
 Xi, NLi, MHu, HDai, W Substituted heteroaryl compounds and methods of use US Patent  US9403801 Publication Date 8/2/2016 
Target
Name:
Tyrosine-protein kinase JAK1
Synonyms:
JAK-1 JAK1A JAK1_HUMAN Janus kinase 1 (JAK1) | Janus kinase 1 JAK1
Type:
Protein
Mol. Mass.:
133293.73
Organism:
Homo sapiens (Human)
Description:
P23458
Residue:
1154
  
Inhibitor
Name:
BDBM239983
Synonyms:
US9403801, 61
Type:
Small organic molecule
Emp. Form.:
C18H25N7O
Mol. Mass.:
355.4374
SMILES:
CC(=O)N1CC2CC(CC2C1)Nc1nc(Nc2cnn(C)c2)ncc1C
: