Target
Tyrosine-protein kinase JAK2
Ligand
BDBM239951
Substrate
Meas. Tech.
Kinase Assay
pH
7±n/a
Temperature
298.15±n/a K
IC50
129±n/a nM
Comments
extracted
Citation
 Xi, NLi, MHu, HDai, W Substituted heteroaryl compounds and methods of use US Patent  US9403801 Publication Date 8/2/2016 
Target
Name:
Tyrosine-protein kinase JAK2
Synonyms:
JAK-2 JAK2_HUMAN Janus kinase 2 (JAK2) | Janus kinase 2 (a protein tyrosine kinase)
Type:
Protein
Mol. Mass.:
130684.68
Organism:
Homo sapiens (Human)
Description:
O60674
Residue:
1132
  
Inhibitor
Name:
BDBM239951
Synonyms:
US9403801, 10
Type:
Small organic molecule
Emp. Form.:
C21H28N8O
Mol. Mass.:
408.5
SMILES:
Cc1cnc(Nc2cnn(C)c2)nc1NC1CCC2(CCN(C2)C(=O)CC#N)CC1
: