Target
Tyrosine-protein kinase JAK3
Ligand
BDBM239955
Substrate
Meas. Tech.
Kinase Assay
pH
7±n/a
Temperature
298.15±n/a K
IC50
39±n/a nM
Comments
extracted
Citation
 Xi, NLi, MHu, HDai, W Substituted heteroaryl compounds and methods of use US Patent  US9403801 Publication Date 8/2/2016 
Target
Name:
Tyrosine-protein kinase JAK3
Synonyms:
JAK-3 JAK3_HUMAN Janus kinase 3 (JAK3) L-JAK | Leukocyte janus kinase
Type:
Protein
Mol. Mass.:
125111.08
Organism:
Homo sapiens (Human)
Description:
P52333
Residue:
1124
  
Inhibitor
Name:
BDBM239955
Synonyms:
US9403801, 14A | US9403801, 14B
Type:
Small organic molecule
Emp. Form.:
C20H25ClN8O
Mol. Mass.:
428.919
SMILES:
Cn1cc(Nc2ncc(Cl)c(NC3CCC4(CCN(C4)C(=O)CC#N)CC3)n2)cn1
: