Target
Procathepsin L
Ligand
BDBM240597
Substrate
US9409882, Z-Val-Val-Arg-AMC
Meas. Tech.
Enzyme Inhibition Assay
pH
6.5±n/a
IC50
340.2±n/a nM
Citation
 Anselm, LBanner, DHaap, WKuhn, BLuebbers, TPeters, JSpinnler, B Pyridine derivatives US Patent  US9409882 Publication Date 8/9/2016 
Target
Name:
Procathepsin L
Synonyms:
CATL1_HUMAN CTSL CTSL1 Cathepsin L Cathepsin L1 heavy chain MEP cathepsin L preproprotein
Type:
Enzyme
Mol. Mass.:
37557.19
Organism:
Homo sapiens (Human)
Description:
Purchased from Calbiochem (San Diego, CA).
Residue:
333
  
Inhibitor
Name:
BDBM240597
Synonyms:
US9409882, 2
Type:
Small organic molecule
Emp. Form.:
C24H22Cl2N4O4S
Mol. Mass.:
533.427
SMILES:
Clc1ccc(nc1)C1(CC1)C(=O)N1C[C@@H](C[C@H]1C(=O)NC1(CC1)C#N)S(=O)(=O)c1ccccc1Cl
:
Substrate
Name:
BDBM210882
Synonyms:
Type:
Small organic molecule
Emp. Form.:
C34H45N7O7
Mol. Mass.:
663.7638
SMILES:
[#6]-[#6](-[#6])-[#6@H](-[#7]-[#6](=O)-[#8]-[#6]-c1ccccc1)-[#6](=O)-[#7]-[#6@@H](-[#6](-[#6])-[#6])-[#6](=O)-[#7]-[#6@@H](-[#6]-[#6]-[#6]\[#7]=[#6](\[#7])-[#7])-[#6](=O)-[#7]-c1ccc2c(-[#6])cc(=O)oc2c1
: