Target
Transient receptor potential M8 protein
Ligand
BDBM241610
Substrate
Meas. Tech.
Functional Assay
Temperature
310.15±n/a K
IC50
20±n/a nM
Comments
extracted
Citation
 Player, MRCalvo, RChen, JMeegalla, SParks, DJParsons, WJBallentine, SBranum, S Substituted aza-bicyclic imidazole derivatives useful as TRPM8 receptor modulators US Patent  US9409915 Publication Date 8/9/2016 
Target
Name:
Transient receptor potential M8 protein
Synonyms:
Cold-menthol receptor (TRPM8) Transient receptor potential M8 protein Transient receptor potential melastatin subfamily, type 8 (TRPM8)
Type:
Enzyme
Mol. Mass.:
127589.43
Organism:
Canis lupus familiaris (Dog)
Description:
Q1A7N1
Residue:
1104
  
Inhibitor
Name:
BDBM241610
Synonyms:
US9409915, 79 | US9718820, Compound 80
Type:
Small organic molecule
Emp. Form.:
C23H24F3N5O2
Mol. Mass.:
459.4642
SMILES:
COc1c(nn(C)c1-c1nc2cc(nc(OC)c2[nH]1)-c1ccccc1C(F)(F)F)C(C)(C)C
: